Visitar URL original
Integration tests · firebase/firebase-cpp-sdk@2e41a1e · GitHub
Skip to content

Integration tests #16403

Integration tests

Integration tests #16403

Triggered via schedule October 7, 2026 11:02
Status Failure
Total duration 27m 44s
Artifacts 5

integration_tests.yml

on: schedule
check_and_prepare
25s
check_and_prepare
Matrix: build_android
Matrix: build_desktop
Matrix: build_ios
Matrix: build_tvos
Matrix: test_android
Matrix: test_desktop
Matrix: test_ios
Matrix: test_tvos
summarize-results
25s
summarize-results
attempt-retry
33s
attempt-retry
Fit to window
Zoom out
Zoom in

Annotations

21 errors, 33 warnings, and 1 notice
build-desktop-macos-15-x64-boringssl
Process completed with exit code 1.
build-desktop-macos-15-x64-boringssl
Process completed with exit code 1.
build-desktop-ubuntu-22.04-x64-openssl
Process completed with exit code 1.
build-desktop-ubuntu-22.04-x64-openssl
Process completed with exit code 1.
build-desktop-ubuntu-22.04-x64-boringssl
Process completed with exit code 1.
build-desktop-ubuntu-22.04-x64-boringssl
Process completed with exit code 1.
build-desktop-ubuntu-22.04-x86-boringssl
Process completed with exit code 1.
build-desktop-ubuntu-22.04-x86-boringssl
Process completed with exit code 1.
build-desktop-ubuntu-22.04-x86-openssl
Process completed with exit code 1.
build-desktop-ubuntu-22.04-x86-openssl
Process completed with exit code 1.
test-desktop-ubuntu-22.04-x86-boringssl
Process completed with exit code 1.
test-desktop-ubuntu-22.04-x86-boringssl
Unable to download artifact(s): Artifact not found for name: testapps-desktop-ubuntu-22.04-x86-boringssl Please ensure that your artifact is not expired and the artifact was uploaded using a compatible version of toolkit/upload-artifact. For more information, visit the GitHub Artifacts FAQ: https://github.com/actions/toolkit/blob/main/packages/artifact/docs/faq.md
test-desktop-ubuntu-22.04-x64-openssl
Process completed with exit code 1.
test-desktop-ubuntu-22.04-x64-openssl
Unable to download artifact(s): Artifact not found for name: testapps-desktop-ubuntu-22.04-x64-openssl Please ensure that your artifact is not expired and the artifact was uploaded using a compatible version of toolkit/upload-artifact. For more information, visit the GitHub Artifacts FAQ: https://github.com/actions/toolkit/blob/main/packages/artifact/docs/faq.md
test-desktop-ubuntu-22.04-x64-boringssl
Process completed with exit code 1.
test-desktop-ubuntu-22.04-x64-boringssl
Unable to download artifact(s): Artifact not found for name: testapps-desktop-ubuntu-22.04-x64-boringssl Please ensure that your artifact is not expired and the artifact was uploaded using a compatible version of toolkit/upload-artifact. For more information, visit the GitHub Artifacts FAQ: https://github.com/actions/toolkit/blob/main/packages/artifact/docs/faq.md
test-desktop-ubuntu-22.04-x86-openssl
Process completed with exit code 1.
test-desktop-ubuntu-22.04-x86-openssl
Unable to download artifact(s): Artifact not found for name: testapps-desktop-ubuntu-22.04-x86-openssl Please ensure that your artifact is not expired and the artifact was uploaded using a compatible version of toolkit/upload-artifact. For more information, visit the GitHub Artifacts FAQ: https://github.com/actions/toolkit/blob/main/packages/artifact/docs/faq.md
test-desktop-macos-15-x64-boringssl
Process completed with exit code 1.
test-desktop-macos-15-x64-boringssl
Unable to download artifact(s): Artifact not found for name: testapps-desktop-macos-15-x64-boringssl Please ensure that your artifact is not expired and the artifact was uploaded using a compatible version of toolkit/upload-artifact. For more information, visit the GitHub Artifacts FAQ: https://github.com/actions/toolkit/blob/main/packages/artifact/docs/faq.md
summarize-results
INTEGRATION TEST FAILURES ————————————————————————— firestore: Errors and Failures (2): - [BUILD] [ERROR] [MacOS] [x64] [boringssl] - [BUILD] [ERROR] [Linux] [All 2 ssl_lib] [All 2 build_type]
check_and_prepare
Node.js 20 is deprecated. The following actions target Node.js 20 but are being forced to run on Node.js 24: actions/checkout@f43a0e5ff2bd294095638e18286ca9a3d1956744, actions/setup-python@7f4fc3e22c37d6ff65e88745f38bd3157c663f7c, lannonbr/repo-permission-check-action@b23b656f0dfb810f0c5e224a264d621a92a6f271, nick-invision/retry@14672906e672a08bd6eeb15720e9ed3ce869cdd4. For more information see: https://github.blog/changelog/2025-09-19-deprecation-of-node-20-on-github-actions-runners/
check_and_prepare
Running against Firestore tip-of-tree
check_and_prepare
Running Firestore nightly tests
check_and_prepare
Running on the expanded matrix
build-desktop-macos-15-x64-boringssl
Node.js 20 is deprecated. The following actions target Node.js 20 but are being forced to run on Node.js 24: actions/cache@6f8efc29b200d32929f49075959781ed54ec270c, actions/checkout@f43a0e5ff2bd294095638e18286ca9a3d1956744, actions/setup-python@7f4fc3e22c37d6ff65e88745f38bd3157c663f7c, actions/upload-artifact@ea165f8d65b6e75b540449e92b4886f43607fa02, nick-invision/retry@14672906e672a08bd6eeb15720e9ed3ce869cdd4. For more information see: https://github.blog/changelog/2025-09-19-deprecation-of-node-20-on-github-actions-runners/
build-desktop-macos-15-x64-boringssl
No files were found with the provided path: testapps-desktop-macos-15-x64-boringssl. No artifacts will be uploaded.
build-desktop-macos-15-x64-boringssl
No files were found with the provided path: D:/a/firebase-cpp-sdk/firebase-cpp-sdk/ta/firestore/iti/CMakeFiles/. No artifacts will be uploaded.
build-desktop-ubuntu-22.04-x64-openssl
Node.js 20 is deprecated. The following actions target Node.js 20 but are being forced to run on Node.js 24: actions/cache@6f8efc29b200d32929f49075959781ed54ec270c, actions/checkout@f43a0e5ff2bd294095638e18286ca9a3d1956744, actions/setup-python@7f4fc3e22c37d6ff65e88745f38bd3157c663f7c, actions/upload-artifact@ea165f8d65b6e75b540449e92b4886f43607fa02, nick-invision/retry@14672906e672a08bd6eeb15720e9ed3ce869cdd4. For more information see: https://github.blog/changelog/2025-09-19-deprecation-of-node-20-on-github-actions-runners/
build-desktop-ubuntu-22.04-x64-openssl
No files were found with the provided path: testapps-desktop-ubuntu-22.04-x64-openssl. No artifacts will be uploaded.
build-desktop-ubuntu-22.04-x64-openssl
No files were found with the provided path: D:/a/firebase-cpp-sdk/firebase-cpp-sdk/ta/firestore/iti/CMakeFiles/. No artifacts will be uploaded.
build-desktop-ubuntu-22.04-x64-boringssl
Node.js 20 is deprecated. The following actions target Node.js 20 but are being forced to run on Node.js 24: actions/cache@6f8efc29b200d32929f49075959781ed54ec270c, actions/checkout@f43a0e5ff2bd294095638e18286ca9a3d1956744, actions/setup-python@7f4fc3e22c37d6ff65e88745f38bd3157c663f7c, actions/upload-artifact@ea165f8d65b6e75b540449e92b4886f43607fa02, nick-invision/retry@14672906e672a08bd6eeb15720e9ed3ce869cdd4. For more information see: https://github.blog/changelog/2025-09-19-deprecation-of-node-20-on-github-actions-runners/
build-desktop-ubuntu-22.04-x64-boringssl
No files were found with the provided path: testapps-desktop-ubuntu-22.04-x64-boringssl. No artifacts will be uploaded.
build-desktop-ubuntu-22.04-x64-boringssl
No files were found with the provided path: D:/a/firebase-cpp-sdk/firebase-cpp-sdk/ta/firestore/iti/CMakeFiles/. No artifacts will be uploaded.
build-desktop-ubuntu-22.04-x86-boringssl
Node.js 20 is deprecated. The following actions target Node.js 20 but are being forced to run on Node.js 24: actions/cache@6f8efc29b200d32929f49075959781ed54ec270c, actions/checkout@f43a0e5ff2bd294095638e18286ca9a3d1956744, actions/setup-python@7f4fc3e22c37d6ff65e88745f38bd3157c663f7c, actions/upload-artifact@ea165f8d65b6e75b540449e92b4886f43607fa02, nick-invision/retry@14672906e672a08bd6eeb15720e9ed3ce869cdd4. For more information see: https://github.blog/changelog/2025-09-19-deprecation-of-node-20-on-github-actions-runners/
build-desktop-ubuntu-22.04-x86-boringssl
No files were found with the provided path: testapps-desktop-ubuntu-22.04-x86-boringssl. No artifacts will be uploaded.
build-desktop-ubuntu-22.04-x86-boringssl
No files were found with the provided path: D:/a/firebase-cpp-sdk/firebase-cpp-sdk/ta/firestore/iti/CMakeFiles/. No artifacts will be uploaded.
build-desktop-ubuntu-22.04-x86-openssl
Node.js 20 is deprecated. The following actions target Node.js 20 but are being forced to run on Node.js 24: actions/cache@6f8efc29b200d32929f49075959781ed54ec270c, actions/checkout@f43a0e5ff2bd294095638e18286ca9a3d1956744, actions/setup-python@7f4fc3e22c37d6ff65e88745f38bd3157c663f7c, actions/upload-artifact@ea165f8d65b6e75b540449e92b4886f43607fa02, nick-invision/retry@14672906e672a08bd6eeb15720e9ed3ce869cdd4. For more information see: https://github.blog/changelog/2025-09-19-deprecation-of-node-20-on-github-actions-runners/
build-desktop-ubuntu-22.04-x86-openssl
No files were found with the provided path: testapps-desktop-ubuntu-22.04-x86-openssl. No artifacts will be uploaded.
build-desktop-ubuntu-22.04-x86-openssl
No files were found with the provided path: D:/a/firebase-cpp-sdk/firebase-cpp-sdk/ta/firestore/iti/CMakeFiles/. No artifacts will be uploaded.
test-desktop-ubuntu-22.04-x86-boringssl
Node.js 20 is deprecated. The following actions target Node.js 20 but are being forced to run on Node.js 24: actions/checkout@f43a0e5ff2bd294095638e18286ca9a3d1956744, actions/download-artifact@d3f86a106a0bac45b974a628896c90dbdf5c8093, actions/upload-artifact@ea165f8d65b6e75b540449e92b4886f43607fa02. For more information see: https://github.blog/changelog/2025-09-19-deprecation-of-node-20-on-github-actions-runners/
test-desktop-ubuntu-22.04-x86-boringssl
No files were found with the provided path: testapps/test-results-desktop-ubuntu-22.04-x86-boringssl*. No artifacts will be uploaded.
test-desktop-ubuntu-22.04-x64-openssl
Node.js 20 is deprecated. The following actions target Node.js 20 but are being forced to run on Node.js 24: actions/checkout@f43a0e5ff2bd294095638e18286ca9a3d1956744, actions/download-artifact@d3f86a106a0bac45b974a628896c90dbdf5c8093, actions/upload-artifact@ea165f8d65b6e75b540449e92b4886f43607fa02. For more information see: https://github.blog/changelog/2025-09-19-deprecation-of-node-20-on-github-actions-runners/
test-desktop-ubuntu-22.04-x64-openssl
No files were found with the provided path: testapps/test-results-desktop-ubuntu-22.04-x64-openssl*. No artifacts will be uploaded.
test-desktop-ubuntu-22.04-x64-boringssl
Node.js 20 is deprecated. The following actions target Node.js 20 but are being forced to run on Node.js 24: actions/checkout@f43a0e5ff2bd294095638e18286ca9a3d1956744, actions/download-artifact@d3f86a106a0bac45b974a628896c90dbdf5c8093, actions/upload-artifact@ea165f8d65b6e75b540449e92b4886f43607fa02. For more information see: https://github.blog/changelog/2025-09-19-deprecation-of-node-20-on-github-actions-runners/
test-desktop-ubuntu-22.04-x64-boringssl
No files were found with the provided path: testapps/test-results-desktop-ubuntu-22.04-x64-boringssl*. No artifacts will be uploaded.
test-desktop-ubuntu-22.04-x86-openssl
Node.js 20 is deprecated. The following actions target Node.js 20 but are being forced to run on Node.js 24: actions/checkout@f43a0e5ff2bd294095638e18286ca9a3d1956744, actions/download-artifact@d3f86a106a0bac45b974a628896c90dbdf5c8093, actions/upload-artifact@ea165f8d65b6e75b540449e92b4886f43607fa02. For more information see: https://github.blog/changelog/2025-09-19-deprecation-of-node-20-on-github-actions-runners/
test-desktop-ubuntu-22.04-x86-openssl
No files were found with the provided path: testapps/test-results-desktop-ubuntu-22.04-x86-openssl*. No artifacts will be uploaded.
test-desktop-macos-15-x64-boringssl
Node.js 20 is deprecated. The following actions target Node.js 20 but are being forced to run on Node.js 24: actions/checkout@f43a0e5ff2bd294095638e18286ca9a3d1956744, actions/download-artifact@d3f86a106a0bac45b974a628896c90dbdf5c8093, actions/upload-artifact@ea165f8d65b6e75b540449e92b4886f43607fa02. For more information see: https://github.blog/changelog/2025-09-19-deprecation-of-node-20-on-github-actions-runners/
test-desktop-macos-15-x64-boringssl
No files were found with the provided path: testapps/test-results-desktop-macos-15-x64-boringssl*. No artifacts will be uploaded.
summarize-results
Node.js 20 is deprecated. The following actions target Node.js 20 but are being forced to run on Node.js 24: actions/checkout@f43a0e5ff2bd294095638e18286ca9a3d1956744, actions/download-artifact@d3f86a106a0bac45b974a628896c90dbdf5c8093, actions/setup-python@7f4fc3e22c37d6ff65e88745f38bd3157c663f7c. For more information see: https://github.blog/changelog/2025-09-19-deprecation-of-node-20-on-github-actions-runners/
attempt-retry
Node.js 20 is deprecated. The following actions target Node.js 20 but are being forced to run on Node.js 24: actions/checkout@f43a0e5ff2bd294095638e18286ca9a3d1956744, actions/setup-python@7f4fc3e22c37d6ff65e88745f38bd3157c663f7c. For more information see: https://github.blog/changelog/2025-09-19-deprecation-of-node-20-on-github-actions-runners/
attempt-retry
attempt-retry
Attempting to retry failed tests
test-desktop-macos-15-x64-boringssl
Due to capacity constraints, jobs targeting macOS arm64 runners may experience longer queue times.

Artifacts

Produced during runtime
Name Size Digest
log-artifact-build-macos-15-x64-boringssl
735 Bytes
sha256:b6a003f974e8fab516e1a48737644c0544908dd9e5f9d0a26750f5ca0d708ca2
log-artifact-build-ubuntu-22.04-x64-boringssl
751 Bytes
sha256:b03885428ea63219ba923a3663106ed17389389688250738795daecbb0796ca1
log-artifact-build-ubuntu-22.04-x64-openssl
746 Bytes
sha256:4a870b79d4d42787780f04b80846eef7a8a3490d67299e2b20b5b12dfd3192c4
log-artifact-build-ubuntu-22.04-x86-boringssl
750 Bytes
sha256:4f7c4793125e17a4d5fa09bef2ecf52e85d099748f86d14a35431ac9b39102b0
log-artifact-build-ubuntu-22.04-x86-openssl
743 Bytes
sha256:c554b6f3ac29a051342cb7eb5486ad0a92745c031ba9d8d5bb4a1a5975b2c021